{"text_format":"1","workbook":"xlsx","n_sheets":12,"sheets":["Instructions","Rate Application","REV","Description_Notes","Information","Equipment list","Expense Detail","Salary Operating and Deprec Exp","Rate Summary","Rate Sheet","Index Summary","Reviewer Notes"],"not_rendered":{"charts":0,"images":2,"macros":1,"external_links":0,"defined_names":18,"comments":1,"pivot_tables":1},"unopened":[],"bounds":{"document_bytes":16777216,"sheet_cells":100000,"rows_first":2000,"rows_last":500,"rows_between":2000,"halvings":0,"cell_chars":16384,"cell_head_chars":4096},"cells_cut":0,"cells_raw":0,"read":"whole","date_system":"1900"}

{"sheet":"Instructions","index":0,"n_rows":41,"n_cols":4,"rows_kept":41,"cut":false,"hidden":false,"merged":[[40,0,40,1],[39,0,39,1],[36,0,36,3],[0,0,0,4],[1,0,1,4],[3,0,3,4],[10,0,10,4],[35,0,35,4],[18,0,18,4],[25,0,26,0]]}
["Service Center Rate Development Worksheet"]
["University of Idaho"]
[]
["General Information:"]
[]
[]
[]
[]
[]
[]
["Sheets and purposes:"]
[]
[]
[]
[]
[]
[]
[]
["Rate Application:"]
[]
{"$rows_left_out":22}
{"sheet":"Rate Application","index":1,"n_rows":41,"n_cols":25,"rows_kept":41,"cut":false,"hidden":false,"merged":[[14,24,14,34],[15,24,15,34],[13,19,13,21],[10,24,11,33],[19,10,19,11],[14,19,14,21],[15,19,15,21],[24,1,24,9],[20,10,20,11],[21,1,21,9],[16,24,16,34],[25,13,29,23],[16,19,16,21],[17,19,17,21],[40,2,40,6],[40,8,40,11],[36,6,36,7],[36,8,36,9],[36,10,36,11],[38,1,38,10],[39,1,39,2],[39,3,39,6],[39,8,39,11],[30,1,30,11],[32,3,32,4],[13,1,13,9],[14,1,14,9],[15,1,15,9],[32,1,32,2],[16,1,16,11],[15,10,15,11],[17,1,17,11],[22,1,22,11],[26,1,26,10],[27,1,27,10],[28,1,28,10],[25,1,25,8],[20,1,20,6],[19,1,19,6],[9,4,9,6],[9,7,9,9],[9,10,9,11],[1,7,1,8],[29,1,29,10],[11,1,11,3],[11,4,11,6],[11,7,11,9],[11,10,11,11],[1,1,1,2],[9,1,9,3],[8,1,8,3],[5,1,5,3],[10,1,10,3],[3,1,3,3],[4,1,4,3],[6,1,6,3],[6,4,6,11],[8,4,8,6],[8,7,8,9],[3,4,3,11],[4,4,4,11],[5,4,5,11],[10,4,10,6],[10,7,10,9],[10,10,10,11],[13,10,13,11],[14,10,14,11]]}
[null,"Service Center Rate Application",null,null,null,null,null,null,null,null,null,"FY2025"]
[null,"For rates effective:",null,null,"2024-10-01",null,null,"Application Type:",null,null," New","Renewal"]
[]
[null,"College/Division",null,null,"Office of Research and Economic Development  "]
[null,"Department",null,null,"Cost Accounting"]
[null,"Service Center Name",null,null,"University Vandal Service Center"]
[null,"Service Center Location & Room#",null,null,"Morrill Hall (017), Room 209D"]
[]
[null,"Contact Information:",null,null,"Name",null,null,"Email",null,null,"Phone #"]
[null,"Worksheet preparer",null,null,"Suzie Grant",null,null,"sgrant@uidaho",null,null,"208-885-4013"]
[null,"College Fiscal Contact",null,null,"Suzie Grant",null,null,"sgrant@uidaho",null,null,"208-885-4013",null,null,null,null,null,null,null,null,null,null,null,null,null,"Summary - Banner screen FGIGLAC by FUND, Prior FISCAL YEAR, ACCOUNT: 90RC (Revenue Control) to review"]
[null,"Service Center Manager",null,null,"Joe Vandal",null,null,"jvandal@uidaho",null,null,"208-885-4013"]
[]
[null,"1) What % of total revenue is charged to internal UI Departments (including your own)?",null,null,null,null,null,null,null,null,{"$f":"X15","v":0.6470588235294118},null,null,null,null,null,null,null,"Index/ Fund #","Index Name",null,null,"Rev","Percent"]
[null,"1.a.) What % of the above internal revenue is charged to sponsored projects (22 funds)?",null,null,null,null,null,null,null,null,{"$f":"X16","v":0.36363636363636365},null,null,null,null,null,null,null,"79XXXX/150000","University Vandal Service Center - Operating Account",null,null,{"$f":"REV!N4","v":16500},{"$f":"W15/W18","v":0.6470588235294118},"Total for all Operating Acct OR if fund is not split out from external customers use the total for ID* revenue types / J Documents"]
[null,"2) What % of total revenue is charged to external (non-UI) customers? *",null,null,null,null,null,null,null,null,{"$f":"X17","v":0.35294117647058826},null,null,null,null,null,null,null,"79XXXX/150000","University Vandal Service Center - Operating Account (22 Funds)",null,null,{"$f":"REV!I22","v":6000},{"$f":"W16/W15","v":0.36363636363636365},"Total of all Funds starting with 22XXXX within the Operating Acct fund (From Service Centers billings)"]
[null,"3) Description of the product(s) or service(s) provided:",null,null,null,null,null,null,null,null,null,null,null,null,null,null,null,null,"79XXXX/151000","University Vandal Service Center - External Customers Account",null,null,{"$f":"REV!N5","v":9000},{"$f":"W17/W18","v":0.35294117647058826},"Total for External Acct OR if fund is not split into it's own index/fund for external customers only, then use the total revenue of all F Documents"]
[null,null,null,null,null,null,null,null,null,null,null,null,null,null,null,null,null,null,null,null,null,null,{"$f":"SUM(W15,W17)","v":25500}]
[]
[null,"4) Do competitors exist outside of the UI?",null,null,null,null,null,null,"Yes","No","If yes, please answer 4.a below"]
{"$rows_left_out":22}
{"sheet":"REV","index":2,"n_rows":22,"n_cols":14,"rows_kept":22,"cut":false,"hidden":false,"merged":[]}
["Code","Acct Code","Trans Date","Rucl Code","Doc Code","Trans Desc","Trnas Amt","Dr Cr Ind","22 Fund"]
[{"$f":"LEFT(D:D,2)","v":"ID"},"90RC","6/11/24, 9:00:06 AM","IDG","J135XXXX","MAY 2024 XXXX CHARGES",7000,"Credit",2000,null,"ID",{"$f":"SUMIF(A:A,K2,G:G)","v":16500}]
["TM","90RC","6/10/24, 11:59:59 PM","TMIS","F024XXXX","GRT25XXXX",5000,"Credit",null,null,"CT",{"$f":"SUMIF(A:A,K3,G:G)","v":0}]
["ID","90RC","6/6/24, 9:19:11 AM","IDG","J135XXXX","FEES FOR FY 2024 - XX",3400,"Credit",725,null,"JE",{"$f":"SUMIF(A:A,K4,G:G)","v":0},"Internal",{"$f":"SUM(L2:L4)","v":16500}]
["ID","90RC","5/30/24, 7:07:31 AM","IDG","J135XXXX","2024 XXXX Charges for XXXX",1040,"Credit",600,null,"TM",{"$f":"SUMIF(A:A,K5,G:G)","v":9000},"External",{"$f":"L5","v":9000}]
["ID","90RC","5/7/24, 7:13:07 AM","IDG","J135XXXX","FY24 QTR 3 XXXX FEES",350,"Credit",100,null,null,{"$f":"SUM(L2:L5)","v":25500}]
["ID","90RC","5/6/24, 2:21:39 PM","IDG","J135XXXX","FEES FOR FY 2024 - XX",2210,"Credit",1075]
["TM","90RC","4/16/24, 11:59:59 PM","TMIS","F024XXXX","GRT25XXXX",4000,"Credit"]
["ID","90RC","7/11/24, 9:00:06 AM","IDG","J135XXXX","JUNE 2024 XXXX CHARGES",2500,"Credit",1500]
[""]
[""]
[""]
[""]
[""]
[""]
[""]
[""]
[""]
[""]
[""]
{"$rows_left_out":3}
{"sheet":"Description_Notes","index":3,"n_rows":28,"n_cols":3,"rows_kept":28,"cut":false,"hidden":false,"merged":[[9,0,24,4],[28,0,42,4]]}
["Department Notes and Comments"]
[]
[]
[]
[]
[]
[]
[]
["Notes about your service center"," "," "]
["Documentation and justifications for subsidizing rate and/or if surplus /deficit over 15% allowable carry-over balance. Rate development spreadsheet will automatically adjust rates down if there is surplus or up to cover deficits, if needed the service center will work with OSP to get plan in place to rebalance service center (making it break-even and compliant)"]
[]
[]
[]
[]
[]
[]
[]
[]
[]
[]
{"$rows_left_out":9}
{"sheet":"Information","index":4,"n_rows":37,"n_cols":15,"rows_kept":37,"cut":false,"hidden":false,"merged":[[34,2,34,4],[35,2,35,4],[36,2,36,4],[23,2,23,4],[32,2,32,4],[11,1,11,2],[10,3,10,5],[11,3,11,5],[33,2,33,4],[21,2,21,4],[15,5,15,9],[14,5,14,9],[19,2,19,4],[20,2,20,4],[18,2,18,4],[17,2,17,4],[26,2,26,4],[9,1,9,2],[7,3,7,5],[8,3,8,5],[9,3,9,5],[10,1,10,2],[4,1,4,3],[2,4,2,5],[6,3,6,5],[7,1,7,2],[8,1,8,2]]}
["Index Information",null,null,null,null,null,null,null,null,{"$f":"'Rate Application'!L1","v":"FY2025"},{"$f":"SUM(RIGHT(J1,4)-1)","v":2024}]
[]
[null,"Service Center Name *",null,null,{"$f":"IF('Rate Application'!E6=0,\"Please fill in Cell E6 on Rate Application Page\",'Rate Application'!E6)","v":"University Vandal Service Center"}]
[null,"Fund # **",null,null,null,150000,null,null,null,null,null,{"$f":"SUM(G8*I8)","v":25000},{"$f":"SUM(20*250)","v":5000},null,{"$f":"L4-M4","v":20000}]
[null,"Operating Index Carry Forward ***",null,null,null,{"$f":"J25","v":1346.4868571428574},null,null,null,null,null,{"$f":"G9*I9","v":7975},null,null,{"$f":"O4+L5","v":27975}]
[]
[null,"Service Name (short)",null,"Brief description of service",null,null,"Current Rate\n(if applicable)","Unit †","Estimated # of annual units ‡","Proposed New Rate  "]
["1)","Data Analysis",null,"Analysis for service centers",null,null,50,"Hour",500,{"$f":"'Rate Summary'!D31","v":65}]
["2)","Meeting Setups",null,"Planning and setup of zoom (hour meeting)",null,null,145,"Fixed",55,{"$f":"'Rate Summary'!E31","v":185}]
["3)",null,null,null,null,null,null,null,null,{"$f":"'Rate Summary'!F31","v":0}]
["4)",null,null,null,null,null,null,null,null,{"$f":"'Rate Summary'!G31","v":0}]
["5)",null,null,null,null,null,null,null,null,{"$f":"'Rate Summary'!H31","v":0}]
[]
["FUND BALANCE AND SUBSIDY INDEX INFORMATION:"]
[]
["Operating index(s):",null,null,null,null,{"$f":"\"FY\"&RIGHT('Rate Application'!L1,2)-1","v":"FY24"}]
[null,"Index/ Fund Number","Index Name",null,null,"Carry Forward","Revenue","Expenditures","Transfers","Ending Balance",null,"15% Allowable Carry-Over","Percent of Surplus/Deficit","Percent Over/Under 15% allowable Carry-Over"]
[null,"79XXXX/150000","University Vandal Service Center - Operating Account",null,null,3000,16500,14900,null,{"$f":"F18+G18-H18-I18","v":4600},null,{"$f":"G18*0.15","v":2475},{"$f":"IFERROR(J18/G18,\"\")","v":0.27878787878787881},{"$f":"IFERROR(IF(J18<0,\"\",J18/SUM(L18-J18)),\"\")","v":-2.164705882352941}]
[null,"79XXXX/151000","University Vandal Service Center - External Customers Account",null,null,-1500,9000,8000,null,{"$f":"F19+G19-H19-I19","v":-500},null,{"$f":"G19*0.15","v":1350},{"$f":"IFERROR(J19/G19,\"\")","v":-5.5555555555555552E-2},{"$f":"IFERROR(IF(J19<0,\"\",J19/SUM(L19-J19)),\"\")","v":""}]
[null," ",null," ",null,0,0,0,0,0,null,0,{"$f":"IFERROR(J20/G20,\"\")","v":""}]
{"$rows_left_out":18}
{"sheet":"Equipment list","index":5,"n_rows":1,"n_cols":28,"rows_kept":1,"cut":false,"hidden":false,"merged":[]}
["Identified","Otag","Ptag","Resp Location Code","Resp Location Title","Building Number","Xref","Room Number","Resp Orgn","Dept","Asset Type","Fund Level 1","Fund Title 1","FY Acquired","Total Cost","F Seq","Index","Fund","Orgn","Account","Program","Asset Name","Disposal Date","Accum Depr","Net Book Value","Dept Name","Useful Life","Remaining Life"]

{"sheet":"Expense Detail","index":6,"n_rows":7,"n_cols":50,"rows_kept":7,"cut":false,"hidden":false,"merged":[]}
["Fiscal Year","Fiscal Period","Activity Date","Chart","Document Code","Document Reference","Vendor Name","Encumbrance Number","Transaction Description","Transaction Date","Transaction Type","Grant Code","Fund Type","Fund Type Title","Fund Level 3","Fund Title 3","Fund Level 4","Fund Title 4","Fund Level 5","Fund Title 5","Fund Predecessor","Fund Predecessor Title","Fund","Fund Title","Level 3 Org","Level 3 Org Title","Index Code","Index Title","Organization","Organization Title","PE","PE Title","Account","Account Title","Program","Program Title","Activity","Activity Code Title","Location Code","Location Title","Dr Cr","Original Budget","Adjusted Budget","YTD","Encumbrance"]
[]
[]
[]
[null,null,null,null,null,null,null,null,null,null,null,null,null,null,null,null,null,null,null,null,null,null,null,null,null,null,null,null,null,null,null,null,null,null,null,null,null,null,null,null,null,null,null,null,null,null,null,"Account","Account Title","Sum of YTD"]
[null,null,null,null,null,null,null,null,null,null,null,null,null,null,null,null,null,null,null,null,null,null,null,null,null,null,null,null,null,null,null,null,null,null,null,null,null,null,null,null,null,null,null,null,null,null,null,"(blank)","(blank)"]
[null,null,null,null,null,null,null,null,null,null,null,null,null,null,null,null,null,null,null,null,null,null,null,null,null,null,null,null,null,null,null,null,null,null,null,null,null,null,null,null,null,null,null,null,null,null,null,"Grand Total"]

{"sheet":"Salary Operating and Deprec Exp","index":7,"n_rows":259,"n_cols":28,"rows_kept":259,"cut":false,"hidden":false,"merged":[[0,9,1,9],[0,10,1,10],[136,22,136,23],[136,24,136,25],[136,26,136,27],[0,11,1,11],[0,12,1,12],[52,11,52,12],[135,26,135,27],[136,12,136,13],[136,14,136,15],[136,16,136,17],[136,18,136,19],[136,20,136,21],[135,22,135,23],[135,24,135,25],[129,0,129,6],[135,12,135,13],[135,14,135,15],[135,16,135,17],[135,18,135,19],[52,3,52,4],[52,5,52,6],[52,7,52,8],[52,9,52,10],[53,13,53,14],[53,3,53,4],[53,5,53,6],[53,7,53,8],[53,9,53,10],[53,11,53,12],[7,8,7,9],[7,10,7,11],[8,8,8,9],[8,10,8,11],[135,20,135,21],[52,13,52,14],[52,15,52,16],[53,15,53,16],[7,22,7,23],[8,22,8,23],[7,12,7,13],[7,14,7,15],[8,12,8,13],[8,14,8,15],[7,18,7,19],[8,18,8,19],[7,20,7,21],[8,20,8,21],[7,16,7,17],[8,16,8,17],[262,5,262,10],[263,5,263,10],[258,5,258,10],[257,5,257,10],[259,5,259,10],[260,5,260,10],[261,5,261,10]]}
[{"$f":"'Rate Application'!L1","v":"FY2025"},null,null,null,null,null,{"$f":"RIGHT(A1,4)-1","v":2024},null,null,"** Employee Type:","Employee Class","Description:","Fringe Rate:"]
[{"$f":"IFERROR('Rate Application'!E7:L7,\"\")","v":""}]
[{"$f":"IFERROR('Rate Application'!E8:L8,\"\")","v":""},null,null,null,null,null,null,null,null,"Faculty \n","F1, F2, F3, F6, F7, F8, FC, SS","All faculty",0.317]
[null,null,null,null,null,null,null,null,null,"Staff\n","AC, C1, C2, C3, CM, E1, E2, E3, EC, P1, P2, P3, T1","Classified, Exempt & TH",0.40100000000000002]
["Salaries and Fringe Benefits",null,null,null,null,null,null,null,null,"Student\n","GA, SF, SI, ST","All other employee types",0.02]
["For instructions on obtaining salary information, please see additional instructions provided on the Instructions page of this workbook",null,null,null,null,null,null,null,null,"Temp/IH\n","E4, F4, F9, P4, T4, T5","Non-student: Temp/ Irregular Help",0.10100000000000001]
[]
["Additional are hidden (rows 16-41). Unhide them if additional rows are needed.",null,null,null,null,null,null,null,{"$f":"Information!B8","v":"Data Analysis"},null,{"$f":"Information!B9","v":"Meeting Setups"},null,{"$f":"Information!B10","v":0},null,{"$f":"Information!B11","v":0},null,{"$f":"Information!B12","v":0},null,"Subsidy",null,"Non-service center ",null,"Check totals *"]
[null,null,null,null,null,null," ",null,{"$f":"Information!D8","v":"Analysis for service centers"},null,{"$f":"Information!D9","v":"Planning and setup of zoom (hour meeting)"},null,{"$f":"Information!D10","v":0},null,{"$f":"Information!D11","v":0},null,{"$f":"Information!D12","v":0},null,"(service center expense paid on another index)",null,"(portion of employee's salary not related to the service center and paid elsewhere)",null,"(should be equal to annual amount column)"]
["Name","Employee V#","PCN","Employee Class **","Annual Salary","FTE","Fringe Benefits (estimate)","Total Cost","FTE %","Amount","FTE %","Amount","FTE %","Amount","FTE %","Amount","FTE %","Amount","FTE %","Amount","FTE %","Amount","%","Amount"]
["Joe Vandal","V12345678","P11111","Faculty",65000,1,{"$f":"IF(E11=0,0,IF(D11=\"Faculty\",((E11*F11)*$M$3),IF(D11=\"Staff\",((E11*F11)*$M$4),IF(D11=\"Student\",((F11*E11)*$M$5),IF(D11=\"Temp/IH\",((F11*E11)*$M$6),\"Need Type\")))))","v":20605},{"$f":"G11+E11","v":85605},0.25,{"$f":"I11*H11","v":21401.25},null,{"$f":"K11*H11","v":0},null,{"$f":"M11*H11","v":0},null,{"$f":"O11*H11","v":0},null,{"$f":"Q11*H11","v":0},0.5,{"$f":"S11*$H11","v":42802.5},{"$f":"1-SUMIF(I11:T11,\"<1.01\",I11:T11)","v":0.25},{"$f":"U11*$H11","v":21401.25},{"$f":"IFERROR(X11/H11,0)","v":1},{"$f":"SUMIF(I11:V11,\">1\",I11:V11)","v":85605},{"$f":"IF(X11<>H11,\"Check allocations\",\"\")","v":""}]
["Suzie Grant","V12345678","P2222","Staff",30000,0.5,6015,{"$f":"G12+E12","v":36015},null,{"$f":"I12*H12","v":0},null,0,null,0,null,{"$f":"O12*H12","v":0},null,{"$f":"Q12*H12","v":0},0.05,{"$f":"S12*$H12","v":1800.75},0.95,{"$f":"U12*$H12","v":34214.25},1,36015,""]
[" ",null," ","Faculty",null,null,0,{"$f":"G13+E13","v":0},null,{"$f":"I13*H13","v":0},null,0,null,0,null,{"$f":"O13*H13","v":0},null,{"$f":"Q13*H13","v":0},null,{"$f":"S13*$H13","v":0},1,0,0,0,""]
[" ",null," ","Faculty",null,null,0,{"$f":"G14+E14","v":0},null,{"$f":"I14*H14","v":0},null,0,null,0,null,{"$f":"O14*H14","v":0},null,{"$f":"Q14*H14","v":0},null,0,1,0,0,0,""]
[" ",null," ","Faculty",null,null,0,{"$f":"G15+E15","v":0},null,{"$f":"I15*H15","v":0},null,0,null,0,null,{"$f":"O15*H15","v":0},null,{"$f":"Q15*H15","v":0},null,{"$f":"S15*$H15","v":0},1,0,0,0,""]
[" ",null," ","Faculty",null,null,0,{"$f":"G16+E16","v":0},null,{"$f":"I16*H16","v":0},null,0,null,0,null,{"$f":"O16*H16","v":0},null,{"$f":"Q16*H16","v":0},null,0,1,0,0,0,""]
[" ",null," ","staff",null,null,0,{"$f":"G17+E17","v":0},null,{"$f":"I17*H17","v":0},null,0,null,0,null,{"$f":"O17*H17","v":0},null,{"$f":"Q17*H17","v":0},null,{"$f":"S17*$H17","v":0},1,0,0,0,""]
[" ",null," ","staff",null,null,0,{"$f":"G18+E18","v":0},null,{"$f":"I18*H18","v":0},null,0,null,0,null,{"$f":"O18*H18","v":0},null,{"$f":"Q18*H18","v":0},null,0,1,0,0,0,""]
[" ",null," ","staff",null,null,0,{"$f":"G19+E19","v":0},null,{"$f":"I19*H19","v":0},null,0,null,0,null,{"$f":"O19*H19","v":0},null,{"$f":"Q19*H19","v":0},null,{"$f":"S19*$H19","v":0},1,0,0,0,""]
[" ",null," ","staff",null,null,0,{"$f":"G20+E20","v":0},null,{"$f":"I20*H20","v":0},null,0,null,0,null,{"$f":"O20*H20","v":0},null,{"$f":"Q20*H20","v":0},null,0,1,0,0,0,""]
{"$rows_left_out":240}
{"sheet":"Rate Summary","index":8,"n_rows":45,"n_cols":10,"rows_kept":45,"cut":false,"hidden":false,"merged":[[5,3,5,7]]}
[{"$f":"IFERROR('Rate Application'!E7:L7,\"\")","v":""}]
[{"$f":"Information!F4","v":150000}]
["Service Center Rate Summary Sheet"]
[{"$f":"'Rate Application'!L1","v":"FY2025"}]
[]
[null,null,null,null,null,null,null,null,"TOTAL"]
[null,"Y/N","%",{"$f":"Information!B8","v":"Data Analysis"},{"$f":"Information!B9","v":"Meeting Setups"},{"$f":"Information!B10","v":0},{"$f":"Information!B11","v":0},{"$f":"Information!B12","v":0},"All Services"]
["Current year rates",null,null,{"$f":"IF((ISBLANK(Information!G$8)=TRUE),\"N/A\",+Information!G$8)","v":50},{"$f":"IF((ISBLANK(Information!$G9)=TRUE),\"N/A\",+Information!$G9)","v":145},{"$f":"IF((ISBLANK(Information!$G10)=TRUE),\"N/A\",+Information!$G10)","v":"N/A"},{"$f":"IF((ISBLANK(Information!$G11)=TRUE),\"N/A\",+Information!$G11)","v":"N/A"},{"$f":"IF((ISBLANK(Information!$G12)=TRUE),\"N/A\",+Information!$G12)","v":"N/A"},"(not include subsidy)"]
["Prior Year Fund Balance (if applicable)",null,null,{"$f":"IFERROR((Information!$F$5*'Rate Summary'!D34),0)","v":1011.457892891667},{"$f":"IFERROR((Information!$F$5*'Rate Summary'!E34),0)","v":335.02896425119036},{"$f":"IFERROR((Information!$F$5*'Rate Summary'!F34),0)","v":0},{"$f":"IFERROR((Information!$F$5*'Rate Summary'!G34),0)","v":0},{"$f":"IFERROR((Information!$F$5*'Rate Summary'!H34),0)","v":0},{"$f":"SUM(D9:H9)","v":1346.4868571428574}]
[]
["ANNUAL COSTS"]
["Salaries and Fringe Benefits",null,null,{"$f":"'Salary Operating and Deprec Exp'!J44","v":21401.25},{"$f":"'Salary Operating and Deprec Exp'!L44","v":0},{"$f":"'Salary Operating and Deprec Exp'!N44","v":0},{"$f":"'Salary Operating and Deprec Exp'!P44","v":0},{"$f":"'Salary Operating and Deprec Exp'!R44","v":0},{"$f":"SUM(D12:H12)","v":21401.25}]
["Operating Costs",null,null,{"$f":"'Salary Operating and Deprec Exp'!E125","v":7680},{"$f":"'Salary Operating and Deprec Exp'!G125","v":8120},{"$f":"'Salary Operating and Deprec Exp'!I125","v":0},{"$f":"'Salary Operating and Deprec Exp'!K125","v":0},{"$f":"'Salary Operating and Deprec Exp'!M125","v":0},{"$f":"SUM(D13:H13)","v":15800}]
["Capital equipment depreciation",null,null,{"$f":"IFERROR('Salary Operating and Deprec Exp'!N252,0)","v":932.08457142857151},{"$f":"IFERROR('Salary Operating and Deprec Exp'!P252,0)","v":1821.4285714285711},{"$f":"IFERROR('Salary Operating and Deprec Exp'!R252,0)","v":0},{"$f":"IFERROR('Salary Operating and Deprec Exp'!T252,0)","v":0},{"$f":"IFERROR('Salary Operating and Deprec Exp'!V252,0)","v":0},{"$f":"SUM(D14:H14)","v":2753.5131428571426}]
[null,null,null,null,null,null,null,null,null,"Annual costs totals check"]
["SUBTOTAL ANNUAL SERVICE COSTS",null,null,{"$f":"SUM(D12:D15)","v":30013.334571428572},{"$f":"SUM(E12:E15)","v":9941.4285714285706},0,0,0,{"$f":"SUM(D16:H16)","v":39954.76314285714},{"$f":"ROUND((-$I$16+'Salary Operating and Deprec Exp'!AB254+'Salary Operating and Deprec Exp'!Q127+'Salary Operating and Deprec Exp'!X46),0)","v":0}]
[]
["Estimated 2 months working capital",null,null,{"$f":"D16/365*60","v":4933.6988336594914},{"$f":"E16*0.166","v":1650.2771428571427},0,0,0,{"$f":"SUM(D18:H18)","v":6583.9759765166345}]
[]
["TOTAL ANNUAL SERVICE COSTS (includes working capital)",null,null,{"$f":"D16+D18","v":34947.033405088063},{"$f":"E16+E18","v":11591.705714285714},0,0,0,{"$f":"SUM(D20:H20)","v":46538.739119373779}]
{"$rows_left_out":26}
{"sheet":"Rate Sheet","index":9,"n_rows":25,"n_cols":5,"rows_kept":25,"cut":false,"hidden":false,"merged":[[4,0,4,4],[1,0,1,4],[2,0,2,4],[3,0,3,4]]}
[]
["Service Center Billing Rates"]
[{"$f":"'Rate Application'!L1","v":"FY2025"}]
[{"$f":"'Rate Application'!E6","v":"University Vandal Service Center"}]
[{"$f":"+Information!F4","v":150000}]
[]
["Service ","Description","Unit"," Internal Rate","External Rate"]
[{"$f":"Information!B8","v":"Data Analysis"},{"$f":"Information!D8","v":"Analysis for service centers"},{"$f":"Information!H8","v":"Hour"},{"$f":"Information!J8","v":65},{"$f":"IFERROR('Rate Summary'!D43,\"N/A\")","v":154.55930949238049}]
[{"$f":"Information!B9","v":"Meeting Setups"},{"$f":"Information!D9","v":"Planning and setup of zoom (hour meeting)"},{"$f":"Information!H9","v":"Fixed"},{"$f":"Information!J9","v":185},{"$f":"IFERROR('Rate Summary'!E43,\"N/A\")","v":465.70359120073942}]
[{"$f":"Information!B10","v":0},{"$f":"Information!D10","v":0},{"$f":"Information!H10","v":0},{"$f":"Information!J10","v":0},{"$f":"IFERROR('Rate Summary'!F43,\"N/A\")","v":0}]
[{"$f":"Information!B11","v":0},{"$f":"Information!D11","v":0},{"$f":"Information!H11","v":0},{"$f":"Information!J11","v":0},{"$f":"IFERROR('Rate Summary'!G43,\"N/A\")","v":0}]
[{"$f":"Information!B12","v":0},{"$f":"Information!D12","v":0},{"$f":"Information!H12","v":0},{"$f":"Information!J12","v":0},{"$f":"IFERROR('Rate Summary'!H43,\"N/A\")","v":0}]
[]
[]
[]
[]
["Approver's Signatures",null,null,"Date"]
[]
[]
[]
{"$rows_left_out":6}
{"sheet":"Index Summary","index":10,"n_rows":26,"n_cols":8,"rows_kept":26,"cut":false,"hidden":false,"merged":[[0,0,0,3],[2,0,2,3],[5,0,5,3],[5,5,5,8],[1,0,1,2]]}
[{"$f":"'Rate Application'!E7&\" Index Summary\"","v":"Morrill Hall (017), Room 209D Index Summary"}]
[{"$f":"IFERROR(Information!E3,\"\")","v":"University Vandal Service Center"}]
[{"$f":"'Rate Application'!L1","v":"FY2025"}]
[]
[]
[{"$f":"Information!B18&\" \"&Information!D18","v":"79XXXX/150000 "},null,null,null,null,{"$f":"Information!B27&\" \"&Information!C27","v":"79XXXX/151001 University Vandal Service Center - Equip Reserve Account"}]
["Projected Operating Index",null,null,null,null,"Projected Capital Equip Replacement Index"]
[]
["Revenue",null,null,null,null,"Depreciation"]
[null,{"$f":"+Information!B8","v":"Data Analysis"},{"$f":"IFERROR(('Rate Summary'!D31*'Rate Summary'!D26),0)","v":32500},null,null,null,"Transfer from operating index **",{"$f":"C20+C25","v":2753.5131428571426}]
[null,{"$f":"+Information!B9","v":"Meeting Setups"},{"$f":"IFERROR(('Rate Summary'!E31*'Rate Summary'!E26),0)","v":10175},null,null,null,"Prior year carryover",{"$f":"Information!J27","v":7753.5131428571422}]
[null,{"$f":"+Information!B10","v":0},{"$f":"IFERROR(('Rate Summary'!F$31*'Rate Summary'!F$26),0)","v":0}]
[null,{"$f":"+Information!B11","v":0},{"$f":"IFERROR(('Rate Summary'!G$31*'Rate Summary'!G$26),0)","v":0},null,null,"Total Accumulated Depreciation",null,{"$f":"SUM(H10:H12)","v":10507.026285714284}]
[null,{"$f":"+Information!B12","v":0},{"$f":"IFERROR(('Rate Summary'!H$31*'Rate Summary'!H$26),0)","v":0}]
["Total Revenue",null,{"$f":"SUM(C10:C14)","v":42675},null,null,"Expenditures"]
[null,null,null,null,null,null,"Capital Outlay > $5,000 *"]
["Expenditures"]
[null,"Salaries, Fringes, TH",{"$f":"'Salary Operating and Deprec Exp'!X46","v":21401.25}]
[null,"Operating Expenses",{"$f":"'Salary Operating and Deprec Exp'!Q127","v":15800}]
[null,"Capital Equipment depreciation transfer",{"$f":"IFERROR('Salary Operating and Deprec Exp'!AB254,0)","v":2753.5131428571426}]
{"$rows_left_out":7}
{"sheet":"Reviewer Notes","index":11,"n_rows":29,"n_cols":6,"rows_kept":29,"cut":false,"hidden":false,"merged":[[35,1,35,4],[36,1,36,4],[29,1,29,4],[30,1,30,4],[31,1,31,4],[32,1,32,4],[33,1,33,4],[34,1,34,4]]}
["Service Center Reviewer Notes"]
[null,null,null,"Recommend approval","Recommend        Rework"]
["Date"]
["Reviewer"]
[]
[]
[null,"Fund",{"$f":"Information!B18","v":"79XXXX/150000"},{"$f":"Information!C18","v":"University Vandal Service Center - Operating Account"}]
[]
[null,"Fund Balance",{"$f":"\"FY\"&RIGHT('Rate Application'!L1,2)-1","v":"FY24"},{"$f":"\"FY\"&ABS(RIGHT(C9,2)-1)","v":"FY23"},{"$f":"\"FY\"&ABS(RIGHT(D9,2)-1)","v":"FY22"}]
[null,"Beg Balance"]
[null,"Revenues"]
[null,"Expenditures"]
[null,"Encumbrances"]
[null,"Transfers Out"]
[]
[null,"Ending Balance",{"$f":"C10+C11-C12-C13-C14","v":0},{"$f":"D10+D11-D12-D13-D14","v":0},0]
[]
[null,"Fund",{"$f":"Information!B27","v":"79XXXX/151001"},{"$f":"Information!#REF!","v":{"$error":"#REF!"}}]
[]
[null,"Fund Balance",{"$f":"\"FY\"&RIGHT('Rate Application'!L1,2)-1","v":"FY24"},{"$f":"\"FY\"&ABS(RIGHT(C20,2)-1)","v":"FY23"},{"$f":"\"FY\"&ABS(RIGHT(D20,2)-1)","v":"FY22"}]
{"$rows_left_out":9}